Howdy, Stranger!

It looks like you're new here. If you want to get involved, click one of these buttons!

Sign In with Facebook Sign In with Google Sign In with OpenID

Categories

We have migrated to a new platform! Please note that you will need to reset your password to log in (your credentials are still in-tact though). Please contact lee@programmersheaven.com if you have questions.
Welcome to the new platform of Programmer's Heaven! We apologize for the inconvenience caused, if you visited us from a broken link of the previous version. The main reason to move to a new platform is to provide more effective and collaborative experience to you all. Please feel free to experience the new platform and use its exciting features. Contact us for any issue that you need to get clarified. We are more than happy to help you.

error: 'MULTIPART_EVENT_START' undeclared

flamer_X86flamer_X86 Posts: 2Member
Hi,

Could you help me fix this error? I got this during my installation of uploadprogress extension in linux.

/usr/local/src/uploadprogress-1.0.0/uploadprogress.c:75: error: 'MULTIPART_EVENT_START' undeclared (first use in this function)
/usr/local/src/uploadprogress-1.0.0/uploadprogress.c:75: error: (Each undeclared identifier is reported only once
/usr/local/src/uploadprogress-1.0.0/uploadprogress.c:75: error: for each function it appears in.)
/usr/local/src/uploadprogress-1.0.0/uploadprogress.c:76: error: 'multipart_event_start' undeclared (first use in this function)
/usr/local/src/uploadprogress-1.0.0/uploadprogress.c:76: error: 'e_data' undeclared (first use in this function)
/usr/local/src/uploadprogress-1.0.0/uploadprogress.c:77: error: expected expression before ')' token
/usr/local/src/uploadprogress-1.0.0/uploadprogress.c:87: error: 'MULTIPART_EVENT_FORMDATA' undeclared (first use in this function)
/usr/local/src/uploadprogress-1.0.0/uploadprogress.c:89: error: 'multipart_event_formdata' undeclared (first use in this function)
/usr/local/src/uploadprogress-1.0.0/uploadprogress.c:90: error: expected expression before ')' token
/usr/local/src/uploadprogress-1.0.0/uploadprogress.c:124: error: 'MULTIPART_EVENT_FILE_START' undeclared (first use in this function)
/usr/local/src/uploadprogress-1.0.0/uploadprogress.c:127: error: 'multipart_event_file_start' undeclared (first use in this function)
/usr/local/src/uploadprogress-1.0.0/uploadprogress.c:129: error: expected expression before ')' token
/usr/local/src/uploadprogress-1.0.0/uploadprogress.c:146: error: 'MULTIPART_EVENT_FILE_DATA' undeclared (first use in this function)
/usr/local/src/uploadprogress-1.0.0/uploadprogress.c:147: error: 'multipart_event_file_data' undeclared (first use in this function)
/usr/local/src/uploadprogress-1.0.0/uploadprogress.c:149: error: expected expression before ')' token
/usr/local/src/uploadprogress-1.0.0/uploadprogress.c:163: error: 'MULTIPART_EVENT_FILE_END' undeclared (first use in this function)
/usr/local/src/uploadprogress-1.0.0/uploadprogress.c:164: error: 'multipart_event_file_end' undeclared (first use in this function)
/usr/local/src/uploadprogress-1.0.0/uploadprogress.c:166: error: expected expression before ')' token
/usr/local/src/uploadprogress-1.0.0/uploadprogress.c:176: error: 'MULTIPART_EVENT_END' undeclared (first use in this function)
make: *** [uploadprogress.lo] Error 1
[root@loft2866 uploadprogress-1.0.0]# make install
/bin/sh /usr/local/src/uploadprogress-1.0.0/libtool --mode=compile gcc -I. -I/usr/local/src/uploadprogress-1.0.0 -DPHP_ATOM_INC -I/usr/local/src/uploadprogress-1.0.0/include -I/usr/local/src/uploadprogress-1.0.0/main -I/usr/local/src/uploadprogress-1.0.0 -I/usr/include/php -I/usr/include/php/main -I/usr/include/php/TSRM -I/usr/include/php/Zend -I/usr/include/php/ext -DHAVE_CONFIG_H -g -O2 -c /usr/local/src/uploadprogress-1.0.0/uploadprogress.c -o uploadprogress.lo
gcc -I. -I/usr/local/src/uploadprogress-1.0.0 -DPHP_ATOM_INC -I/usr/local/src/uploadprogress-1.0.0/include -I/usr/local/src/uploadprogress-1.0.0/main -I/usr/local/src/uploadprogress-1.0.0 -I/usr/include/php -I/usr/include/php/main -I/usr/include/php/TSRM -I/usr/include/php/Zend -I/usr/include/php/ext -DHAVE_CONFIG_H -g -O2 -c /usr/local/src/uploadprogress-1.0.0/uploadprogress.c -fPIC -DPIC -o .libs/uploadprogress.o
/usr/local/src/uploadprogress-1.0.0/uploadprogress.c: In function 'uploadprogress_php_rfc1867_file':
/usr/local/src/uploadprogress-1.0.0/uploadprogress.c:75: error: 'MULTIPART_EVENT_START' undeclared (first use in this function)
/usr/local/src/uploadprogress-1.0.0/uploadprogress.c:75: error: (Each undeclared identifier is reported only once
/usr/local/src/uploadprogress-1.0.0/uploadprogress.c:75: error: for each function it appears in.)
/usr/local/src/uploadprogress-1.0.0/uploadprogress.c:76: error: 'multipart_event_start' undeclared (first use in this function)
/usr/local/src/uploadprogress-1.0.0/uploadprogress.c:76: error: 'e_data' undeclared (first use in this function)
/usr/local/src/uploadprogress-1.0.0/uploadprogress.c:77: error: expected expression before ')' token
/usr/local/src/uploadprogress-1.0.0/uploadprogress.c:87: error: 'MULTIPART_EVENT_FORMDATA' undeclared (first use in this function)
/usr/local/src/uploadprogress-1.0.0/uploadprogress.c:89: error: 'multipart_event_formdata' undeclared (first use in this function)
/usr/local/src/uploadprogress-1.0.0/uploadprogress.c:90: error: expected expression before ')' token
/usr/local/src/uploadprogress-1.0.0/uploadprogress.c:124: error: 'MULTIPART_EVENT_FILE_START' undeclared (first use in this function)
/usr/local/src/uploadprogress-1.0.0/uploadprogress.c:127: error: 'multipart_event_file_start' undeclared (first use in this function)
/usr/local/src/uploadprogress-1.0.0/uploadprogress.c:129: error: expected expression before ')' token
/usr/local/src/uploadprogress-1.0.0/uploadprogress.c:146: error: 'MULTIPART_EVENT_FILE_DATA' undeclared (first use in this function)
/usr/local/src/uploadprogress-1.0.0/uploadprogress.c:147: error: 'multipart_event_file_data' undeclared (first use in this function)
/usr/local/src/uploadprogress-1.0.0/uploadprogress.c:149: error: expected expression before ')' token
/usr/local/src/uploadprogress-1.0.0/uploadprogress.c:163: error: 'MULTIPART_EVENT_FILE_END' undeclared (first use in this function)
/usr/local/src/uploadprogress-1.0.0/uploadprogress.c:164: error: 'multipart_event_file_end' undeclared (first use in this function)
/usr/local/src/uploadprogress-1.0.0/uploadprogress.c:166: error: expected expression before ')' token
/usr/local/src/uploadprogress-1.0.0/uploadprogress.c:176: error: 'MULTIPART_EVENT_END' undeclared (first use in this function)
make: *** [uploadprogress.lo] Error 1
Sign In or Register to comment.